Target
Estrogen receptor beta
Ligand
BDBM40034
Substrate
Meas. Tech.
Estrogen Receptor-beta Coactivator Binding Inhibitors ELISA Secondary Assay
IC50
23±n/a nM
Citation
 PubChem, PC Estrogen Receptor-beta Coactivator Binding Inhibitors ELISA Secondary Assay PubChem Bioassay (2008)[AID] 
Target
Name:
Estrogen receptor beta
Synonyms:
ER-beta ESR2_HUMAN Estradiol receptor beta (ERβ) Estrogen receptor (ER beta) Estrogen receptor beta (ER beta) NR3A2 estrogen beta
Type:
Protein
Mol. Mass.:
59238.43
Organism:
Homo sapiens (Human)
Description:
Q92731
Residue:
530
  
Inhibitor
Name:
BDBM40034
Synonyms:
MLS000093573 N-(4-methyl-3-oxidanylidene-1,4-benzothiazin-6-yl)-4-piperidin-1-yl-piperidine-1-carboxamide N-(4-methyl-3-oxo-1,4-benzothiazin-6-yl)-4-piperidin-1-ylpiperidine-1-carboxamide SMR000029191 | cid_3241667
Type:
Small organic molecule
Emp. Form.:
C20H28N4O2S
Mol. Mass.:
388.527
SMILES:
CN1C(=O)CSc2ccc(NC(=O)N3CCC(CC3)N3CCCCC3)cc12
: