Target
Transcription factor p65
Ligand
BDBM49170
Substrate
Meas. Tech.
Name: High Throughput Screen to Identify Compounds that increase expression of NF-kB in Human Neuronal Cells - Dose Response
EC50
17324±n/a nM
Citation
 PubChem, PC Name: High Throughput Screen to Identify Compounds that increase expression of NF-kB in Human Neuronal Cells - Dose Response PubChem Bioassay (2008)[AID] 
Target
Name:
Transcription factor p65
Synonyms:
NFKB3 Nuclear factor NF-kappa-B p65 subunit TF65_HUMAN | v-rel reticuloendotheliosis viral oncogene homolog A isoform 1
Type:
Enzyme
Mol. Mass.:
60211.92
Organism:
Homo sapiens (Human)
Description:
Q04206
Residue:
551
  
Inhibitor
Name:
BDBM49170
Synonyms:
MLS000029143 N-(5-chloranylpyridin-2-yl)-4-methyl-benzamide N-(5-chloro-2-pyridyl)-4-methyl-benzamide SMR000011220 | cid_644704
Type:
Small organic molecule
Emp. Form.:
C13H11ClN2O
Mol. Mass.:
246.692
SMILES:
Cc1ccc(cc1)C(=O)Nc1ccc(Cl)cn1
: