Target
Transcription factor p65
Ligand
BDBM49213
Substrate
Meas. Tech.
Name: High Throughput Screen to Identify Compounds that increase expression of NF-kB in Human Neuronal Cells - Dose Response
EC50
2454±n/a nM
Citation
 PubChem, PC Name: High Throughput Screen to Identify Compounds that increase expression of NF-kB in Human Neuronal Cells - Dose Response PubChem Bioassay (2008)[AID] 
Target
Name:
Transcription factor p65
Synonyms:
NFKB3 Nuclear factor NF-kappa-B p65 subunit TF65_HUMAN | v-rel reticuloendotheliosis viral oncogene homolog A isoform 1
Type:
Enzyme
Mol. Mass.:
60211.92
Organism:
Homo sapiens (Human)
Description:
Q04206
Residue:
551
  
Inhibitor
Name:
BDBM49213
Synonyms:
MLS000097468 N-(2,3-dihydro-1H-inden-5-yl)-5-methyl-pyrazine-2-carboxamide N-indan-5-yl-5-methyl-pyrazinamide cid_1459738
Type:
Small organic molecule
Emp. Form.:
C15H15N3O
Mol. Mass.:
253.2991
SMILES:
Cc1cnc(cn1)C(=O)Nc1ccc2CCCc2c1
: