Target
Transcription factor p65
Ligand
BDBM49214
Substrate
Meas. Tech.
Name: High Throughput Screen to Identify Compounds that increase expression of NF-kB in Human Neuronal Cells - Dose Response
EC50
3234±n/a nM
Citation
 PubChem, PC Name: High Throughput Screen to Identify Compounds that increase expression of NF-kB in Human Neuronal Cells - Dose Response PubChem Bioassay (2008)[AID] 
Target
Name:
Transcription factor p65
Synonyms:
NFKB3 Nuclear factor NF-kappa-B p65 subunit TF65_HUMAN | v-rel reticuloendotheliosis viral oncogene homolog A isoform 1
Type:
Enzyme
Mol. Mass.:
60211.92
Organism:
Homo sapiens (Human)
Description:
Q04206
Residue:
551
  
Inhibitor
Name:
BDBM49214
Synonyms:
2-Hydroxy-N-p-tolylbenzamide (10) 2-hydroxy-N-(p-tolyl)benzamide N-(4-methylphenyl)-2-oxidanyl-benzamide cid_478805
Type:
Small organic molecule
Emp. Form.:
C14H13NO2
Mol. Mass.:
227.2585
SMILES:
Cc1ccc(NC(=O)c2ccccc2O)cc1
: