Target
Transcription factor p65
Ligand
BDBM49417
Substrate
Meas. Tech.
Name: High Throughput Screen to Identify Compounds that increase expression of NF-kB in Human Neuronal Cells - Dose Response
EC50
189±n/a nM
Citation
 PubChem, PC Name: High Throughput Screen to Identify Compounds that increase expression of NF-kB in Human Neuronal Cells - Dose Response PubChem Bioassay (2008)[AID] 
Target
Name:
Transcription factor p65
Synonyms:
NFKB3 Nuclear factor NF-kappa-B p65 subunit TF65_HUMAN | v-rel reticuloendotheliosis viral oncogene homolog A isoform 1
Type:
Enzyme
Mol. Mass.:
60211.92
Organism:
Homo sapiens (Human)
Description:
Q04206
Residue:
551
  
Inhibitor
Name:
BDBM49417
Synonyms:
(4-hexoxyphenyl) pyridine-3-carboxylate MLS000518890 cid_4254794 | nicotinic acid (4-hexoxyphenyl) ester
Type:
Small organic molecule
Emp. Form.:
C18H21NO3
Mol. Mass.:
299.3642
SMILES:
CCCCCCOc1ccc(OC(=O)c2cccnc2)cc1
: