Target
Induced myeloid leukemia cell differentiation protein Mcl-1
Ligand
BDBM47259
Substrate
Meas. Tech.
Dose Response Confirmation for Mcl-1/Noxa Interaction Inhibitors
IC50
400±n/a nM
Citation
 PubChem, PC Dose Response Confirmation for Mcl-1/Noxa Interaction Inhibitors PubChem Bioassay (2008)[AID] 
Target
Name:
Induced myeloid leukemia cell differentiation protein Mcl-1
Synonyms:
BCL2L3 Bcl-2-like protein 3 (Mcl-1) Bcl2-L-3 MCL1 Mcl-1 Myeloid cell leukemia sequence 1 (BCL2-related) | mcl1/EAT
Type:
Membrane; Single-pass membrane protein
Mol. Mass.:
37332.87
Organism:
Homo sapiens (Human)
Description:
Q07820
Residue:
350
  
Inhibitor
Name:
BDBM47259
Synonyms:
4-Isopropyl-9-thioxo-2,3,9,10-tetrahydro-1H,8H-6-thia-5,8,10-triaza-cyclopenta[c]fluoren-7-one SMR000219200 | cid_929947
Type:
Small organic molecule
Emp. Form.:
C15H15N3OS2
Mol. Mass.:
317.429
SMILES:
CC(C)c1nc2sc3c([nH]c(=S)[nH]c3=O)c2c2CCCc12
: