Target
Induced myeloid leukemia cell differentiation protein Mcl-1
Ligand
BDBM29677
Substrate
Meas. Tech.
Dose Response Confirmation for Mcl-1/Noxa Interaction Inhibitors
IC50
1436.725854±n/a nM
Citation
 PubChem, PC Dose Response Confirmation for Mcl-1/Noxa Interaction Inhibitors PubChem Bioassay (2008)[AID] 
Target
Name:
Induced myeloid leukemia cell differentiation protein Mcl-1
Synonyms:
BCL2L3 Bcl-2-like protein 3 (Mcl-1) Bcl2-L-3 MCL1 Mcl-1 Myeloid cell leukemia sequence 1 (BCL2-related) | mcl1/EAT
Type:
Membrane; Single-pass membrane protein
Mol. Mass.:
37332.87
Organism:
Homo sapiens (Human)
Description:
Q07820
Residue:
350
  
Inhibitor
Name:
BDBM29677
Synonyms:
(3E)-3-(2-furanylmethylidene)-1,2-dihydrocyclopenta[b]quinoline-9-carboxylic acid [2-[2-cyanoethyl(methyl)amino]-2-oxoethyl] ester MLS000335532 [2-[2-cyanoethyl(methyl)amino]-2-oxidanylidene-ethyl] (3E)-3-(furan-2-ylmethylidene)-1,2-dihydrocyclopenta[b]quinoline-9-carboxylate cid_5801934
Type:
Small organic molecule
Emp. Form.:
C24H21N3O4
Mol. Mass.:
415.4412
SMILES:
CN(CCC#N)C(=O)COC(=O)c1c2CC\C(=C/c3ccco3)c2nc2ccccc12
: