Target
Glycoprotein 42
Ligand
BDBM50860
Substrate
Meas. Tech.
Dose Response Confirmation for Small Molecule Inhibitors of Epstein-Barr Virus
IC50
530±n/a nM
Citation
 PubChem, PC Dose Response Confirmation for Small Molecule Inhibitors of Epstein-Barr Virus PubChem Bioassay (2008)[AID] 
Target
Name:
Glycoprotein 42
Synonyms:
BZLF2 | GP42_EBVA8
Type:
Enzyme Catalytic Domain
Mol. Mass.:
25424.12
Organism:
Human herpesvirus 4 type 2
Description:
gi_139424501
Residue:
223
  
Inhibitor
Name:
BDBM50860
Synonyms:
2-(3-Cyano-6-methyl-quinolin-2-ylsulfanyl)-N-(2-morpholin-4-yl-phenyl)-acetamide 2-(3-cyano-6-methylquinolin-2-yl)sulfanyl-N-(2-morpholin-4-ylphenyl)acetamide 2-[(3-cyano-6-methyl-2-quinolyl)thio]-N-(2-morpholinophenyl)acetamide SMR000118725 | cid_3207505
Type:
Small organic molecule
Emp. Form.:
C23H22N4O2S
Mol. Mass.:
418.511
SMILES:
Cc1ccc2nc(SCC(=O)Nc3ccccc3N3CCOCC3)c(cc2c1)C#N
: