Target
Glycoprotein 42
Ligand
BDBM50910
Substrate
Meas. Tech.
Dose Response Confirmation for Small Molecule Inhibitors of Epstein-Barr Virus
IC50
54000±n/a nM
Citation
 PubChem, PC Dose Response Confirmation for Small Molecule Inhibitors of Epstein-Barr Virus PubChem Bioassay (2008)[AID] 
Target
Name:
Glycoprotein 42
Synonyms:
BZLF2 | GP42_EBVA8
Type:
Enzyme Catalytic Domain
Mol. Mass.:
25424.12
Organism:
Human herpesvirus 4 type 2
Description:
gi_139424501
Residue:
223
  
Inhibitor
Name:
BDBM50910
Synonyms:
(5Z)-5-[[2-(3-ethoxypropylamino)-4-keto-9-methyl-pyrido[1,2-a]pyrimidin-3-yl]methylene]-3-isobutyl-2-thioxo-thiazolidin-4-one (5Z)-5-[[2-(3-ethoxypropylamino)-9-methyl-4-oxo-3-pyrido[1,2-a]pyrimidinyl]methylidene]-3-(2-methylpropyl)-2-sulfanylidene-4-thiazolidinone 2-(3-Ethoxy-propylamino)-3-[3-isobutyl-4-oxo-2-thioxo-thiazolidin-(5Z)-ylidenemethyl]-9-methyl-pyrido[1, 2-a]pyrimidin-4-one SMR000147896 | cid_1987067
Type:
Small organic molecule
Emp. Form.:
C22H28N4O3S2
Mol. Mass.:
460.613
SMILES:
CCOCCCNc1nc2c(C)cccn2c(=O)c1\C=C1/SC(=S)N(CC(C)C)C1=O
: