Target
Glycoprotein 42
Ligand
BDBM50957
Substrate
Meas. Tech.
Dose Response Confirmation for Small Molecule Inhibitors of Epstein-Barr Virus
IC50
2210±n/a nM
Citation
 PubChem, PC Dose Response Confirmation for Small Molecule Inhibitors of Epstein-Barr Virus PubChem Bioassay (2008)[AID] 
Target
Name:
Glycoprotein 42
Synonyms:
BZLF2 | GP42_EBVA8
Type:
Enzyme Catalytic Domain
Mol. Mass.:
25424.12
Organism:
Human herpesvirus 4 type 2
Description:
gi_139424501
Residue:
223
  
Inhibitor
Name:
BDBM50957
Synonyms:
(5Z)-2-(p-tolyl)-5-veratrylidene-2-thiazolin-4-one (5Z)-5-[(3,4-dimethoxyphenyl)methylidene]-2-(4-methylphenyl)-4-thiazolone MLS000579815 cid_1730304
Type:
Small organic molecule
Emp. Form.:
C19H17NO3S
Mol. Mass.:
339.408
SMILES:
COc1ccc(\C=C2/SC(=NC2=O)c2ccc(C)cc2)cc1OC
: