Target
Glycoprotein 42
Ligand
BDBM51030
Substrate
Meas. Tech.
Dose Response Confirmation for Small Molecule Inhibitors of Epstein-Barr Virus
IC50
840±n/a nM
Citation
 PubChem, PC Dose Response Confirmation for Small Molecule Inhibitors of Epstein-Barr Virus PubChem Bioassay (2008)[AID] 
Target
Name:
Glycoprotein 42
Synonyms:
BZLF2 | GP42_EBVA8
Type:
Enzyme Catalytic Domain
Mol. Mass.:
25424.12
Organism:
Human herpesvirus 4 type 2
Description:
gi_139424501
Residue:
223
  
Inhibitor
Name:
BDBM51030
Synonyms:
8-amino-3-hexyl-1H-benzo[g]pteridine-2,4-dione 8-azanyl-3-hexyl-1H-benzo[g]pteridine-2,4-dione SMR000217535 | cid_5549699
Type:
Small organic molecule
Emp. Form.:
C16H19N5O2
Mol. Mass.:
313.3544
SMILES:
CCCCCCn1c(=O)[nH]c2nc3cc(N)ccc3nc2c1=O
: