Target
Glycoprotein 42
Ligand
BDBM51050
Substrate
Meas. Tech.
Dose Response Confirmation for Small Molecule Inhibitors of Epstein-Barr Virus
IC50
1510±n/a nM
Citation
 PubChem, PC Dose Response Confirmation for Small Molecule Inhibitors of Epstein-Barr Virus PubChem Bioassay (2008)[AID] 
Target
Name:
Glycoprotein 42
Synonyms:
BZLF2 | GP42_EBVA8
Type:
Enzyme Catalytic Domain
Mol. Mass.:
25424.12
Organism:
Human herpesvirus 4 type 2
Description:
gi_139424501
Residue:
223
  
Inhibitor
Name:
BDBM51050
Synonyms:
2-(6-morpholin-4-yl-1,3-dioxobenzo[de]isoquinolin-2-yl)ethyl 3,5-dichlorobenzoate 3,5-dichlorobenzoic acid 2-(1,3-diketo-6-morpholino-benzo[de]isoquinolin-2-yl)ethyl ester MLS000722259 cid_5065577
Type:
Small organic molecule
Emp. Form.:
C25H20Cl2N2O5
Mol. Mass.:
499.343
SMILES:
Clc1cc(Cl)cc(c1)C(=O)OCCN1C(=O)c2cccc3c(ccc(C1=O)c23)N1CCOCC1
: