Target
Glycoprotein 42
Ligand
BDBM50094893
Substrate
Meas. Tech.
Dose Response Confirmation for Small Molecule Inhibitors of Epstein-Barr Virus
IC50
3740±n/a nM
Citation
 PubChem, PC Dose Response Confirmation for Small Molecule Inhibitors of Epstein-Barr Virus PubChem Bioassay (2008)[AID] 
Target
Name:
Glycoprotein 42
Synonyms:
BZLF2 | GP42_EBVA8
Type:
Enzyme Catalytic Domain
Mol. Mass.:
25424.12
Organism:
Human herpesvirus 4 type 2
Description:
gi_139424501
Residue:
223
  
Inhibitor
Name:
BDBM50094893
Synonyms:
1-Amino-4-hydroxy-anthraquinone CHEMBL88326 | cid_8323
Type:
Small organic molecule
Emp. Form.:
C14H9NO3
Mol. Mass.:
239.2262
SMILES:
Nc1ccc(O)c2C(=O)c3ccccc3C(=O)c12
: