Target
Glycoprotein 42
Ligand
BDBM51236
Substrate
Meas. Tech.
Dose Response Confirmation for Small Molecule Inhibitors of Epstein-Barr Virus
IC50
910±n/a nM
Citation
 PubChem, PC Dose Response Confirmation for Small Molecule Inhibitors of Epstein-Barr Virus PubChem Bioassay (2008)[AID] 
Target
Name:
Glycoprotein 42
Synonyms:
BZLF2 | GP42_EBVA8
Type:
Enzyme Catalytic Domain
Mol. Mass.:
25424.12
Organism:
Human herpesvirus 4 type 2
Description:
gi_139424501
Residue:
223
  
Inhibitor
Name:
BDBM51236
Synonyms:
6-Oxo-6H-anthra[1,9-cd]isoxazole-3-carboxylic acid (2,2-dimethoxy-ethyl)-amide SMR000425485 | cid_1916369
Type:
Small organic molecule
Emp. Form.:
C19H16N2O5
Mol. Mass.:
352.3407
SMILES:
COC(CNC(=O)c1ccc2C(=O)c3ccccc3-c3onc1c23)OC
: