Target
DNA repair protein RAD51 homolog 1
Ligand
BDBM32329
Substrate
Meas. Tech.
Homologous Recombination_Rad51_DNA binding assay
IC50
42500±n/a nM
Citation
 PubChem, PC Homologous Recombination_Rad51_DNA binding assay PubChem Bioassay (2008)[AID] 
Target
Name:
DNA repair protein RAD51 homolog 1
Synonyms:
RAD51 RAD51_HUMAN | RECA
Type:
Enzyme Catalytic Domain
Mol. Mass.:
36960.74
Organism:
Homo sapiens (Human)
Description:
gi_49168602
Residue:
339
  
Inhibitor
Name:
BDBM32329
Synonyms:
(2Z)-3-ethyl-2-[(E)-3-(3-ethyl-1,3-benzothiazol-3-ium-2-yl)-2-methyl-prop-2-enylidene]-1,3-benzothiazole;iodide Cyanines, 1 SMR000354813 | cid_6364517
Type:
Small organic molecule
Emp. Form.:
C22H23N2S2
Mol. Mass.:
379.561
SMILES:
CCN1\C(Sc2ccccc12)=C\C(\C)=C\c1sc2ccccc2[n+]1CC
: