Target
DNA repair protein RAD51 homolog 1
Ligand
BDBM50174412
Substrate
Meas. Tech.
Homologous Recombination_Rad51_DNA binding assay
IC50
26820±n/a nM
Citation
 PubChem, PC Homologous Recombination_Rad51_DNA binding assay PubChem Bioassay (2008)[AID] 
Target
Name:
DNA repair protein RAD51 homolog 1
Synonyms:
RAD51 RAD51_HUMAN | RECA
Type:
Enzyme Catalytic Domain
Mol. Mass.:
36960.74
Organism:
Homo sapiens (Human)
Description:
gi_49168602
Residue:
339
  
Inhibitor
Name:
BDBM50174412
Synonyms:
9-Methoxy-5,11-dimethyl-6H-pyrido[4,3-b]carbazole 9-methoxy ellipticine CHEMBL19954 cid_72512
Type:
Small organic molecule
Emp. Form.:
C18H16N2O
Mol. Mass.:
276.3324
SMILES:
COc1ccc2[nH]c3c(C)c4ccncc4c(C)c3c2c1
: