Target
DNA repair protein RAD51 homolog 1
Ligand
BDBM50056939
Substrate
Meas. Tech.
Homologous Recombination_Rad51_DNA binding assay
IC50
85000±n/a nM
Citation
 PubChem, PC Homologous Recombination_Rad51_DNA binding assay PubChem Bioassay (2008)[AID] 
Target
Name:
DNA repair protein RAD51 homolog 1
Synonyms:
RAD51 RAD51_HUMAN | RECA
Type:
Enzyme Catalytic Domain
Mol. Mass.:
36960.74
Organism:
Homo sapiens (Human)
Description:
gi_49168602
Residue:
339
  
Inhibitor
Name:
BDBM50056939
Synonyms:
4-Formyl-3-hydroxy-8-methoxy-1,9-dimethyl-11-oxo-11H-dibenzo[b,e][1,4]dioxepine-6-carboxylic acid NSC-92186 cid_23725
Type:
Small organic molecule
Emp. Form.:
C18H14O8
Mol. Mass.:
358.299
SMILES:
COc1cc(C(O)=O)c2Oc3c(C=O)c(O)cc(C)c3C(=O)Oc2c1C
: