Target
DNA repair protein RAD51 homolog 1
Ligand
BDBM51312
Substrate
Meas. Tech.
Homologous recombination_Rad 51_dose response_2
IC50
21110±n/a nM
Citation
 PubChem, PC Homologous recombination_Rad 51_dose response_2 PubChem Bioassay (2008)[AID] 
Target
Name:
DNA repair protein RAD51 homolog 1
Synonyms:
RAD51 RAD51_HUMAN | RECA
Type:
Enzyme Catalytic Domain
Mol. Mass.:
36960.74
Organism:
Homo sapiens (Human)
Description:
gi_49168602
Residue:
339
  
Inhibitor
Name:
BDBM51312
Synonyms:
3-[(8,9-dimethoxy-2-phenyl-[1,2,4]triazolo[1,5-c]quinazolin-5-yl)amino]propyl-diethyl-amine N-(8,9-dimethoxy-2-phenyl-[1,2,4]triazolo[1,5-c]quinazolin-5-yl)-N',N'-diethyl-propane-1,3-diamine SMR000130891 cid_6622924
Type:
Small organic molecule
Emp. Form.:
C24H30N6O2
Mol. Mass.:
434.534
SMILES:
CCN(CC)CCCNc1nc2cc(OC)c(OC)cc2c2nc(nn12)-c1ccccc1
: