Target
E3 ubiquitin-protein ligase Mdm2
Ligand
BDBM43373
Substrate
Meas. Tech.
E3 Ligase_Mutant_Dose Response
EC50
4100±n/a nM
Citation
 PubChem, PC E3 Ligase_Mutant_Dose Response PubChem Bioassay (2008)[AID] 
Target
Name:
E3 ubiquitin-protein ligase Mdm2
Synonyms:
Double minute 2 protein E3 ubiquitin-protein ligase Mdm2 (p53-binding protein Mdm2) Human Double Minute 2 (HDM2) MDM2-MDMX p53-Binding Protein MDM2 | p53-binding protein
Type:
Oncoprotein
Mol. Mass.:
55196.54
Organism:
Homo sapiens (Human)
Description:
Q00987
Residue:
491
  
Inhibitor
Name:
BDBM43373
Synonyms:
(5-Cyano-4-oxo-2-phenyl-3,4-dihydro-2H-[1,3]thiazin-6-ylsulfanyl)-acetic acid methyl ester 2-[(5-cyano-4-oxo-2-phenyl-2,3-dihydro-1,3-thiazin-6-yl)thio]acetic acid methyl ester SMR000147717 methyl 2-[(5-cyano-4-oxidanylidene-2-phenyl-2,3-dihydro-1,3-thiazin-6-yl)sulfanyl]ethanoate | methyl 2-[(5-cyano-4-oxo-2-phenyl-2,3-dihydro-1,3-thiazin-6-yl)sulfanyl]acetate
Type:
Small organic molecule
Emp. Form.:
C14H12N2O3S2
Mol. Mass.:
320.387
SMILES:
COC(=O)CSC1=C(C#N)C(=O)NC(S1)c1ccccc1
: