Target
Alkaline phosphatase, tissue-nonspecific isozyme
Ligand
BDBM51398
Substrate
Meas. Tech.
SAR assay for compounds activating TNAP in the presence of 100 mM DEA performed in a luminescence assay
EC50
8090±n/a nM
Citation
 PubChem, PC SAR assay for compounds activating TNAP in the presence of 100 mM DEA performed in a luminescence assay PubChem Bioassay (2009)[AID] 
Target
Name:
Alkaline phosphatase, tissue-nonspecific isozyme
Synonyms:
ALPL tissue-nonspecific alkaline phosphatase precursor
Type:
PROTEIN
Mol. Mass.:
57306.17
Organism:
Homo sapiens (Human)
Description:
ChEMBL_1448917
Residue:
524
  
Inhibitor
Name:
BDBM51398
Synonyms:
2-(4-methylphenyl)sulfanyl-N-(1H-1,2,4-triazol-5-yl)acetamide 2-(p-tolylthio)-N-(1H-1,2,4-triazol-5-yl)acetamide MLS-0146326.0001 | cid_1244970
Type:
Small organic molecule
Emp. Form.:
C11H12N4OS
Mol. Mass.:
248.304
SMILES:
Cc1ccc(SCC(=O)Nc2nnc[nH]2)cc1
: