Target
Alkaline phosphatase, tissue-nonspecific isozyme
Ligand
BDBM43798
Substrate
Meas. Tech.
SAR assay for compounds activating TNAP in the presence of 100 mM DEA performed in a luminescence assay
EC50
54400±n/a nM
Citation
 PubChem, PC SAR assay for compounds activating TNAP in the presence of 100 mM DEA performed in a luminescence assay PubChem Bioassay (2009)[AID] 
Target
Name:
Alkaline phosphatase, tissue-nonspecific isozyme
Synonyms:
ALPL tissue-nonspecific alkaline phosphatase precursor
Type:
PROTEIN
Mol. Mass.:
57306.17
Organism:
Homo sapiens (Human)
Description:
ChEMBL_1448917
Residue:
524
  
Inhibitor
Name:
BDBM43798
Synonyms:
(1-benzylbenzimidazol-2-yl)methyl-[1-(2-piperidinoethyl)benzimidazol-2-yl]amine N-[(1-benzylbenzimidazol-2-yl)methyl]-1-(2-piperidin-1-ylethyl)benzimidazol-2-amine N-[[1-(phenylmethyl)benzimidazol-2-yl]methyl]-1-(2-piperidin-1-ylethyl)benzimidazol-2-amine | cid_1043331
Type:
Small organic molecule
Emp. Form.:
C29H32N6
Mol. Mass.:
464.6046
SMILES:
C(Cn1c(NCc2nc3ccccc3n2Cc2ccccc2)nc2ccccc12)N1CCCCC1
: