Target
Alkaline phosphatase, tissue-nonspecific isozyme
Ligand
BDBM51411
Substrate
Meas. Tech.
SAR assay for compounds activating TNAP in the presence of 100 mM DEA performed in a luminescence assay
EC50
4570±n/a nM
Citation
 PubChem, PC SAR assay for compounds activating TNAP in the presence of 100 mM DEA performed in a luminescence assay PubChem Bioassay (2009)[AID] 
Target
Name:
Alkaline phosphatase, tissue-nonspecific isozyme
Synonyms:
ALPL tissue-nonspecific alkaline phosphatase precursor
Type:
PROTEIN
Mol. Mass.:
57306.17
Organism:
Homo sapiens (Human)
Description:
ChEMBL_1448917
Residue:
524
  
Inhibitor
Name:
BDBM51411
Synonyms:
3-(1-azepanylsulfonyl)-4-chloro-N-(1H-1,2,4-triazol-5-yl)benzamide 3-(azepan-1-ylsulfonyl)-4-chloro-N-(1H-1,2,4-triazol-5-yl)benzamide cid_2359007
Type:
Small organic molecule
Emp. Form.:
C15H18ClN5O3S
Mol. Mass.:
383.853
SMILES:
Clc1ccc(cc1S(=O)(=O)N1CCCCCC1)C(=O)Nc1nnc[nH]1
: