Target
P2X purinoceptor 7
Ligand
BDBM267108
Substrate
Meas. Tech.
Fluo-8 No Wash Calcium Assa
IC50
30.0±n/a nM
Citation
 Pevarello, PLohmer, SLlberati, CSeneci, PPesenti, CPrandi, A Substituted thiazole or oxazole P2X7 receptor antagonists US Patent  US9718812 Publication Date 8/1/2017 
Target
Name:
P2X purinoceptor 7
Synonyms:
ATP receptor P2RX7_HUMAN P2X purinoceptor 7 (P2X7) P2Z receptor | Purinergic receptor
Type:
Protein
Mol. Mass.:
68602.85
Organism:
Homo sapiens (Human)
Description:
Q99572
Residue:
595
  
Inhibitor
Name:
BDBM267108
Synonyms:
(+)-2-chloro-N-[2-(4,4-difluoropiperidin-1-yl)-2-(4-methyl-1,3-thiazol-5-yl)ethyl]-5-(5-fluoropyrimidin-2-yl)benzamide US9718812, 75
Type:
Small organic molecule
Emp. Form.:
C22H21ClF3N5OS
Mol. Mass.:
495.948
SMILES:
Cc1ncsc1C(CNC(=O)c1cc(ccc1Cl)-c1ncc(F)cn1)N1CCC(F)(F)CC1
: