Target
P2X purinoceptor 7
Ligand
BDBM267158
Substrate
Meas. Tech.
YO-PRO-1 Uptake Assay
IC50
42.0±n/a nM
Citation
 Pevarello, PLohmer, SLlberati, CSeneci, PPesenti, CPrandi, A Substituted thiazole or oxazole P2X7 receptor antagonists US Patent  US9718812 Publication Date 8/1/2017 
Target
Name:
P2X purinoceptor 7
Synonyms:
ATP receptor P2RX7_HUMAN P2X purinoceptor 7 (P2X7) P2Z receptor | Purinergic receptor
Type:
Protein
Mol. Mass.:
68602.85
Organism:
Homo sapiens (Human)
Description:
Q99572
Residue:
595
  
Inhibitor
Name:
BDBM267158
Synonyms:
2-chloro-N-{2-[2-(2,4-difluorophenyl)morpholin-4-yl]-2-(4-methyl-1,3-thiazol-5-yl)ethyl}-6-methylbenzamide US9718812, 100 | US9718812, 101
Type:
Small organic molecule
Emp. Form.:
C24H24ClF2N3O2S
Mol. Mass.:
491.981
SMILES:
Cc1ncsc1C(CNC(=O)c1c(C)cccc1Cl)N1CCOC(C1)c1ccc(F)cc1F
: