Target
Mucolipin-3
Ligand
BDBM46750
Substrate
Meas. Tech.
Fluorescence counterscreen assay for TRPN1 agonists: dose response cell-based high-throughput screening assay to identify agonists of the transient receptor potential channel ML3 (TRPML3)
EC50
29900±n/a nM
Citation
 PubChem, PC Fluorescence counterscreen assay for TRPN1 agonists: dose response cell-based high-throughput screening assay to identify agonists of the transient receptor potential channel ML3 (TRPML3) PubChem Bioassay (2009)[AID] 
Target
Name:
Mucolipin-3
Synonyms:
MCLN3_HUMAN MCOLN3 protein
Type:
Enzyme Catalytic Domain
Mol. Mass.:
64244.09
Organism:
Homo sapiens (Human)
Description:
Q8TDD5
Residue:
553
  
Inhibitor
Name:
BDBM46750
Synonyms:
1,4-bis-(4-methylphenyl)sulfonyl-2-piperazinecarboxylic acid ethyl ester MLS000052120 cid_2974596 ethyl 1,4-bis[(4-methylphenyl)sulfonyl]-2-piperazinecarboxylate
Type:
Small organic molecule
Emp. Form.:
C21H26N2O6S2
Mol. Mass.:
466.571
SMILES:
CCOC(=O)C1CN(CCN1S(=O)(=O)c1ccc(C)cc1)S(=O)(=O)c1ccc(C)cc1
: