Target
Mucolipin-3
Ligand
BDBM46753
Substrate
Meas. Tech.
Fluorescence counterscreen assay for TRPN1 agonists: dose response cell-based high-throughput screening assay to identify agonists of the transient receptor potential channel ML3 (TRPML3)
EC50
29900±n/a nM
Citation
 PubChem, PC Fluorescence counterscreen assay for TRPN1 agonists: dose response cell-based high-throughput screening assay to identify agonists of the transient receptor potential channel ML3 (TRPML3) PubChem Bioassay (2009)[AID] 
Target
Name:
Mucolipin-3
Synonyms:
MCLN3_HUMAN MCOLN3 protein
Type:
Enzyme Catalytic Domain
Mol. Mass.:
64244.09
Organism:
Homo sapiens (Human)
Description:
Q8TDD5
Residue:
553
  
Inhibitor
Name:
BDBM46753
Synonyms:
MLS000063606 N-cycloheptyl-2,4,5-trimethoxybenzamide cid_912400
Type:
Small organic molecule
Emp. Form.:
C17H25NO4
Mol. Mass.:
307.3847
SMILES:
COc1cc(OC)c(cc1OC)C(=O)NC1CCCCCC1
: