Target
Mucolipin-3
Ligand
BDBM46772
Substrate
Meas. Tech.
Fluorescence counterscreen assay for TRPN1 agonists: dose response cell-based high-throughput screening assay to identify agonists of the transient receptor potential channel ML3 (TRPML3)
EC50
1030±n/a nM
Citation
 PubChem, PC Fluorescence counterscreen assay for TRPN1 agonists: dose response cell-based high-throughput screening assay to identify agonists of the transient receptor potential channel ML3 (TRPML3) PubChem Bioassay (2009)[AID] 
Target
Name:
Mucolipin-3
Synonyms:
MCLN3_HUMAN MCOLN3 protein
Type:
Enzyme Catalytic Domain
Mol. Mass.:
64244.09
Organism:
Homo sapiens (Human)
Description:
Q8TDD5
Residue:
553
  
Inhibitor
Name:
BDBM46772
Synonyms:
4-Bromo-N-[N'-(5-methyl-3-phenyl-isoxazole-4-carbonyl)-hydrazinocarbothioyl]-benzamide 4-bromo-N-[[(5-methyl-3-phenyl-1,2-oxazole-4-carbonyl)amino]carbamothioyl]benzamide 4-bromo-N-[[[(5-methyl-3-phenyl-4-isoxazolyl)-oxomethyl]hydrazo]-sulfanylidenemethyl]benzamide SMR000219129 | cid_1884906
Type:
Small organic molecule
Emp. Form.:
C19H15BrN4O3S
Mol. Mass.:
459.316
SMILES:
Cc1onc(c1C(=O)NNC(=S)NC(=O)c1ccc(Br)cc1)-c1ccccc1
: