Target
Mucolipin-3
Ligand
BDBM46796
Substrate
Meas. Tech.
Fluorescence counterscreen assay for TRPN1 agonists: dose response cell-based high-throughput screening assay to identify agonists of the transient receptor potential channel ML3 (TRPML3)
EC50
29900±n/a nM
Citation
 PubChem, PC Fluorescence counterscreen assay for TRPN1 agonists: dose response cell-based high-throughput screening assay to identify agonists of the transient receptor potential channel ML3 (TRPML3) PubChem Bioassay (2009)[AID] 
Target
Name:
Mucolipin-3
Synonyms:
MCLN3_HUMAN MCOLN3 protein
Type:
Enzyme Catalytic Domain
Mol. Mass.:
64244.09
Organism:
Homo sapiens (Human)
Description:
Q8TDD5
Residue:
553
  
Inhibitor
Name:
BDBM46796
Synonyms:
MLS000689391 N-(3-chloro-2-methyl-phenyl)-2-(3-keto-4,6-dimethyl-isothiazolo[5,4-b]pyridin-2-yl)acetamide N-(3-chloro-2-methylphenyl)-2-(4,6-dimethyl-3-oxo-[1,2]thiazolo[5,4-b]pyridin-2-yl)acetamide SMR000311190 | cid_4247467
Type:
Small organic molecule
Emp. Form.:
C17H16ClN3O2S
Mol. Mass.:
361.846
SMILES:
Cc1cc(C)c2c(n1)sn(CC(=O)Nc1cccc(Cl)c1C)c2=O
: