Target
Mucolipin-3
Ligand
BDBM32962
Substrate
Meas. Tech.
Fluorescence counterscreen assay for TRPN1 agonists: dose response cell-based high-throughput screening assay to identify agonists of the transient receptor potential channel ML3 (TRPML3)
EC50
29900±n/a nM
Citation
 PubChem, PC Fluorescence counterscreen assay for TRPN1 agonists: dose response cell-based high-throughput screening assay to identify agonists of the transient receptor potential channel ML3 (TRPML3) PubChem Bioassay (2009)[AID] 
Target
Name:
Mucolipin-3
Synonyms:
MCLN3_HUMAN MCOLN3 protein
Type:
Enzyme Catalytic Domain
Mol. Mass.:
64244.09
Organism:
Homo sapiens (Human)
Description:
Q8TDD5
Residue:
553
  
Inhibitor
Name:
BDBM32962
Synonyms:
4-(p-tolylsulfamoyl)benzoic acid [2-keto-2-[(5-methylisoxazol-3-yl)amino]ethyl] ester MLS001002448 [2-[(5-methyl-1,2-oxazol-3-yl)amino]-2-oxidanylidene-ethyl] 4-[(4-methylphenyl)sulfamoyl]benzoate cid_2116601
Type:
Small organic molecule
Emp. Form.:
C20H19N3O6S
Mol. Mass.:
429.446
SMILES:
Cc1cc(NC(=O)COC(=O)c2ccc(cc2)S(=O)(=O)Nc2ccc(C)cc2)no1
: