Target
Ion channel NompC
Ligand
BDBM44578
Substrate
Meas. Tech.
Fluorescence counterscreen assay for TRPML3 agonists: dose response cell-based high-throughput screening assay to identify agonists of the transient receptor potential channel N1 (TRPN1)
EC50
29900±n/a nM
Citation
 PubChem, PC Fluorescence counterscreen assay for TRPML3 agonists: dose response cell-based high-throughput screening assay to identify agonists of the transient receptor potential channel N1 (TRPN1) PubChem Bioassay (2009)[AID] 
Target
Name:
Ion channel NompC
Synonyms:
transient receptor potential cation channel, subfamily N, member 1
Type:
Enzyme Catalytic Domain
Mol. Mass.:
175824.78
Organism:
Danio rerio
Description:
Q7T1G6
Residue:
1614
  
Inhibitor
Name:
BDBM44578
Synonyms:
1-(5-bromanylthiophen-2-yl)sulfonyl-4-methyl-piperidine 1-[(5-bromo-2-thienyl)sulfonyl]-4-methyl-piperidine 1-[(5-bromo-2-thiophenyl)sulfonyl]-4-methylpiperidine MLS000069556 SMR000058825 cid_15209 | cid_893468
Type:
Small organic molecule
Emp. Form.:
C10H14BrNO2S2
Mol. Mass.:
324.258
SMILES:
CC1CCN(CC1)S(=O)(=O)c1ccc(Br)s1
: