Target
Ion channel NompC
Ligand
BDBM46853
Substrate
Meas. Tech.
Fluorescence counterscreen assay for TRPML3 agonists: dose response cell-based high-throughput screening assay to identify agonists of the transient receptor potential channel N1 (TRPN1)
EC50
29900±n/a nM
Citation
 PubChem, PC Fluorescence counterscreen assay for TRPML3 agonists: dose response cell-based high-throughput screening assay to identify agonists of the transient receptor potential channel N1 (TRPN1) PubChem Bioassay (2009)[AID] 
Target
Name:
Ion channel NompC
Synonyms:
transient receptor potential cation channel, subfamily N, member 1
Type:
Enzyme Catalytic Domain
Mol. Mass.:
175824.78
Organism:
Danio rerio
Description:
Q7T1G6
Residue:
1614
  
Inhibitor
Name:
BDBM46853
Synonyms:
2-[2-keto-2-(2,2,4-trimethyl-1-quinolyl)ethyl]isoindoline-1,3-quinone 2-[2-oxo-2-(2,2,4-trimethyl-1-quinolinyl)ethyl]isoindole-1,3-dione MLS000107523 cid_1219451
Type:
Small organic molecule
Emp. Form.:
C22H20N2O3
Mol. Mass.:
360.4058
SMILES:
CC1=CC(C)(C)N(C(=O)CN2C(=O)c3ccccc3C2=O)c2ccccc12
: