Target
Ion channel NompC
Ligand
BDBM46876
Substrate
Meas. Tech.
Fluorescence counterscreen assay for TRPML3 agonists: dose response cell-based high-throughput screening assay to identify agonists of the transient receptor potential channel N1 (TRPN1)
EC50
29900±n/a nM
Citation
 PubChem, PC Fluorescence counterscreen assay for TRPML3 agonists: dose response cell-based high-throughput screening assay to identify agonists of the transient receptor potential channel N1 (TRPN1) PubChem Bioassay (2009)[AID] 
Target
Name:
Ion channel NompC
Synonyms:
transient receptor potential cation channel, subfamily N, member 1
Type:
Enzyme Catalytic Domain
Mol. Mass.:
175824.78
Organism:
Danio rerio
Description:
Q7T1G6
Residue:
1614
  
Inhibitor
Name:
BDBM46876
Synonyms:
2-[methyl(tosyl)amino]acetic acid [(Z)-[amino-(3-nitrophenyl)methylene]amino] ester MLS000530876 SMR000135854 [(Z)-[azanyl-(3-nitrophenyl)methylidene]amino] 2-[methyl-(4-methylphenyl)sulfonyl-amino]ethanoate | cid_9550114
Type:
Small organic molecule
Emp. Form.:
C17H18N4O6S
Mol. Mass.:
406.413
SMILES:
CN(CC(=O)ON=C(N)c1cccc(c1)[N+]([O-])=O)S(=O)(=O)c1ccc(C)cc1
: