Target
Ion channel NompC
Ligand
BDBM46878
Substrate
Meas. Tech.
Fluorescence counterscreen assay for TRPML3 agonists: dose response cell-based high-throughput screening assay to identify agonists of the transient receptor potential channel N1 (TRPN1)
EC50
29900±n/a nM
Citation
 PubChem, PC Fluorescence counterscreen assay for TRPML3 agonists: dose response cell-based high-throughput screening assay to identify agonists of the transient receptor potential channel N1 (TRPN1) PubChem Bioassay (2009)[AID] 
Target
Name:
Ion channel NompC
Synonyms:
transient receptor potential cation channel, subfamily N, member 1
Type:
Enzyme Catalytic Domain
Mol. Mass.:
175824.78
Organism:
Danio rerio
Description:
Q7T1G6
Residue:
1614
  
Inhibitor
Name:
BDBM46878
Synonyms:
1-isopropyl-4,6-dimethyl-3-(o-tolylsulfonyl)-2-pyridone 4,6-dimethyl-3-(2-methylphenyl)sulfonyl-1-propan-2-yl-2-pyridinone 4,6-dimethyl-3-(2-methylphenyl)sulfonyl-1-propan-2-ylpyridin-2-one SMR000126394 | cid_1483857
Type:
Small organic molecule
Emp. Form.:
C17H21NO3S
Mol. Mass.:
319.419
SMILES:
CC(C)n1c(C)cc(C)c(c1=O)S(=O)(=O)c1ccccc1C
: