Target
Ion channel NompC
Ligand
BDBM46937
Substrate
Meas. Tech.
Fluorescence counterscreen assay for TRPML3 agonists: dose response cell-based high-throughput screening assay to identify agonists of the transient receptor potential channel N1 (TRPN1)
EC50
29900±n/a nM
Citation
 PubChem, PC Fluorescence counterscreen assay for TRPML3 agonists: dose response cell-based high-throughput screening assay to identify agonists of the transient receptor potential channel N1 (TRPN1) PubChem Bioassay (2009)[AID] 
Target
Name:
Ion channel NompC
Synonyms:
transient receptor potential cation channel, subfamily N, member 1
Type:
Enzyme Catalytic Domain
Mol. Mass.:
175824.78
Organism:
Danio rerio
Description:
Q7T1G6
Residue:
1614
  
Inhibitor
Name:
BDBM46937
Synonyms:
1-[bis(bromanyl)methyl]-6-bromanyl-N-tert-butyl-5,5-dimethyl-bicyclo[2.1.1]hexane-4-carboxamide 6-bromo-N-tert-butyl-1-(dibromomethyl)-5,5-dimethyl-4-bicyclo[2.1.1]hexanecarboxamide 6-bromo-N-tert-butyl-1-(dibromomethyl)-5,5-dimethylbicyclo[2.1.1]hexane-4-carboxamide SMR000225336 | cid_4225066
Type:
Small organic molecule
Emp. Form.:
C14H22Br3NO
Mol. Mass.:
460.043
SMILES:
CC(C)(C)NC(=O)C12CCC(C(Br)Br)(C1Br)C2(C)C
: