Target
Ion channel NompC
Ligand
BDBM46965
Substrate
Meas. Tech.
Fluorescence counterscreen assay for TRPML3 agonists: dose response cell-based high-throughput screening assay to identify agonists of the transient receptor potential channel N1 (TRPN1)
EC50
29900±n/a nM
Citation
 PubChem, PC Fluorescence counterscreen assay for TRPML3 agonists: dose response cell-based high-throughput screening assay to identify agonists of the transient receptor potential channel N1 (TRPN1) PubChem Bioassay (2009)[AID] 
Target
Name:
Ion channel NompC
Synonyms:
transient receptor potential cation channel, subfamily N, member 1
Type:
Enzyme Catalytic Domain
Mol. Mass.:
175824.78
Organism:
Danio rerio
Description:
Q7T1G6
Residue:
1614
  
Inhibitor
Name:
BDBM46965
Synonyms:
2,3-bis(chloranyl)-N-methyl-N-phenyl-benzenesulfonamide 2,3-dichloro-N-methyl-N-phenylbenzenesulfonamide SMR000364640 | cid_2696827
Type:
Small organic molecule
Emp. Form.:
C13H11Cl2NO2S
Mol. Mass.:
316.203
SMILES:
CN(c1ccccc1)S(=O)(=O)c1cccc(Cl)c1Cl
: