Target
Ion channel NompC
Ligand
BDBM46993
Substrate
Meas. Tech.
Fluorescence counterscreen assay for TRPML3 agonists: dose response cell-based high-throughput screening assay to identify agonists of the transient receptor potential channel N1 (TRPN1)
EC50
29900±n/a nM
Citation
 PubChem, PC Fluorescence counterscreen assay for TRPML3 agonists: dose response cell-based high-throughput screening assay to identify agonists of the transient receptor potential channel N1 (TRPN1) PubChem Bioassay (2009)[AID] 
Target
Name:
Ion channel NompC
Synonyms:
transient receptor potential cation channel, subfamily N, member 1
Type:
Enzyme Catalytic Domain
Mol. Mass.:
175824.78
Organism:
Danio rerio
Description:
Q7T1G6
Residue:
1614
  
Inhibitor
Name:
BDBM46993
Synonyms:
5-methyl-3-phenyl-4-(2-tosylpyrazol-3-yl)isoxazole 5-methyl-4-[2-(4-methylphenyl)sulfonylpyrazol-3-yl]-3-phenyl-1,2-oxazole MLS001111124 cid_2745600
Type:
Small organic molecule
Emp. Form.:
C20H17N3O3S
Mol. Mass.:
379.432
SMILES:
Cc1onc(c1-c1ccnn1S(=O)(=O)c1ccc(C)cc1)-c1ccccc1
: