Target
Regulator of G-protein signaling 4
Ligand
BDBM47717
Substrate
Meas. Tech.
Dose response, multiplexed high-throughput screen for small molecule regulators of RGS family protein interactions, specifically RGS4-Galphao.
EC50
26420±n/a nM
Citation
 PubChem, PC Dose response, multiplexed high-throughput screen for small molecule regulators of RGS family protein interactions, specifically RGS4-Galphao. PubChem Bioassay (2009)[AID] 
Target
Name:
Regulator of G-protein signaling 4
Synonyms:
RGP4 RGS4_HUMAN | Regulator of G-protein signaling 4 (RGS4)
Type:
Enzyme
Mol. Mass.:
23263.51
Organism:
Homo sapiens (Human)
Description:
P49798
Residue:
205
  
Inhibitor
Name:
BDBM47717
Synonyms:
5-Ethylamino-anthra[1,9-cd]isoxazol-6-one SMR000116070 | cid_776361
Type:
Small organic molecule
Emp. Form.:
C16H12N2O2
Mol. Mass.:
264.2787
SMILES:
CCNc1ccc2noc3-c4ccccc4C(=O)c1c23
: