Target
Regulator of G-protein signaling 4
Ligand
BDBM47733
Substrate
Meas. Tech.
Dose response, multiplexed high-throughput screen for small molecule regulators of RGS family protein interactions, specifically RGS4-Galphao.
EC50
30000±n/a nM
Citation
 PubChem, PC Dose response, multiplexed high-throughput screen for small molecule regulators of RGS family protein interactions, specifically RGS4-Galphao. PubChem Bioassay (2009)[AID] 
Target
Name:
Regulator of G-protein signaling 4
Synonyms:
RGP4 RGS4_HUMAN | Regulator of G-protein signaling 4 (RGS4)
Type:
Enzyme
Mol. Mass.:
23263.51
Organism:
Homo sapiens (Human)
Description:
P49798
Residue:
205
  
Inhibitor
Name:
BDBM47733
Synonyms:
4-(5-Phenoxymethyl-4-phenyl-4H-[1,2,4]triazol-3-ylsulfanylmethyl)-1H-quinolin-2-one 4-[[[5-(phenoxymethyl)-4-phenyl-1,2,4-triazol-3-yl]thio]methyl]-1H-quinolin-2-one MLS000547635 cid_1134963
Type:
Small organic molecule
Emp. Form.:
C25H20N4O2S
Mol. Mass.:
440.517
SMILES:
O=c1cc(CSc2nnc(COc3ccccc3)n2-c2ccccc2)c2ccccc2[nH]1
: