Target
Regulator of G-protein signaling 4
Ligand
BDBM47734
Substrate
Meas. Tech.
Dose response, multiplexed high-throughput screen for small molecule regulators of RGS family protein interactions, specifically RGS4-Galphao.
EC50
11800±n/a nM
Citation
 PubChem, PC Dose response, multiplexed high-throughput screen for small molecule regulators of RGS family protein interactions, specifically RGS4-Galphao. PubChem Bioassay (2009)[AID] 
Target
Name:
Regulator of G-protein signaling 4
Synonyms:
RGP4 RGS4_HUMAN | Regulator of G-protein signaling 4 (RGS4)
Type:
Enzyme
Mol. Mass.:
23263.51
Organism:
Homo sapiens (Human)
Description:
P49798
Residue:
205
  
Inhibitor
Name:
BDBM47734
Synonyms:
MLS000553854 N-[(8-Hydroxy-5-nitro-quinolin-7-yl)-p-tolyl-methyl]-propionamide N-[(8-hydroxy-5-nitro-7-quinolyl)-(p-tolyl)methyl]propionamide SMR000172089 | cid_2922056
Type:
Small organic molecule
Emp. Form.:
C20H19N3O4
Mol. Mass.:
365.3826
SMILES:
CCC(=O)NC(c1ccc(C)cc1)c1cc([N+]([O-])=O)c2cccnc2c1O
: