Target
Regulator of G-protein signaling 4
Ligand
BDBM47745
Substrate
Meas. Tech.
Dose response, multiplexed high-throughput screen for small molecule regulators of RGS family protein interactions, specifically RGS4-Galphao.
EC50
30000±n/a nM
Citation
 PubChem, PC Dose response, multiplexed high-throughput screen for small molecule regulators of RGS family protein interactions, specifically RGS4-Galphao. PubChem Bioassay (2009)[AID] 
Target
Name:
Regulator of G-protein signaling 4
Synonyms:
RGP4 RGS4_HUMAN | Regulator of G-protein signaling 4 (RGS4)
Type:
Enzyme
Mol. Mass.:
23263.51
Organism:
Homo sapiens (Human)
Description:
P49798
Residue:
205
  
Inhibitor
Name:
BDBM47745
Synonyms:
5-([1,3]dioxolo[4,5-f][1,3]benzothiazol-6-ylamino)-3-methyl-2-thiophenecarboxylic acid ethyl ester MLS000720389 cid_7110093 ethyl 5-([1,3]dioxolo[4,5-f][1,3]benzothiazol-6-ylamino)-3-methylthiophene-2-carboxylate
Type:
Small organic molecule
Emp. Form.:
C16H14N2O4S2
Mol. Mass.:
362.423
SMILES:
CCOC(=O)c1sc(Nc2nc3cc4OCOc4cc3s2)cc1C
: