Target
Regulator of G-protein signaling 4
Ligand
BDBM47806
Substrate
Meas. Tech.
Dose response, multiplexed high-throughput screen for small molecule regulators of RGS family protein interactions, specifically RGS4-Galphao.
EC50
30000±n/a nM
Citation
 PubChem, PC Dose response, multiplexed high-throughput screen for small molecule regulators of RGS family protein interactions, specifically RGS4-Galphao. PubChem Bioassay (2009)[AID] 
Target
Name:
Regulator of G-protein signaling 4
Synonyms:
RGP4 RGS4_HUMAN | Regulator of G-protein signaling 4 (RGS4)
Type:
Enzyme
Mol. Mass.:
23263.51
Organism:
Homo sapiens (Human)
Description:
P49798
Residue:
205
  
Inhibitor
Name:
BDBM47806
Synonyms:
6-amino-5-[1-oxo-2-[[4-oxo-3-(phenylmethyl)-2-quinazolinyl]thio]ethyl]-1-propylpyrimidine-2,4-dione 6-amino-5-[2-[(3-benzyl-4-keto-quinazolin-2-yl)thio]acetyl]-1-propyl-pyrimidine-2,4-quinone MLS001004090 cid_2566659
Type:
Small organic molecule
Emp. Form.:
C24H23N5O4S
Mol. Mass.:
477.536
SMILES:
CCCn1c(N)c(C(=O)CSc2nc3ccccc3c(=O)n2Cc2ccccc2)c(=O)[nH]c1=O
: