Target
Regulator of G-protein signaling 4
Ligand
BDBM47822
Substrate
Meas. Tech.
Dose response, multiplexed high-throughput screen for small molecule regulators of RGS family protein interactions, specifically RGS4-Galphao.
EC50
30000±n/a nM
Citation
 PubChem, PC Dose response, multiplexed high-throughput screen for small molecule regulators of RGS family protein interactions, specifically RGS4-Galphao. PubChem Bioassay (2009)[AID] 
Target
Name:
Regulator of G-protein signaling 4
Synonyms:
RGP4 RGS4_HUMAN | Regulator of G-protein signaling 4 (RGS4)
Type:
Enzyme
Mol. Mass.:
23263.51
Organism:
Homo sapiens (Human)
Description:
P49798
Residue:
205
  
Inhibitor
Name:
BDBM47822
Synonyms:
3-[5-(2-furanyl)-1H-pyrazol-3-yl]-4-(2-methoxyphenyl)-1H-1,2,4-triazole-5-thione 3-[5-(furan-2-yl)-1H-pyrazol-3-yl]-4-(2-methoxyphenyl)-1H-1,2,4-triazole-5-thione MLS000769411 cid_950682
Type:
Small organic molecule
Emp. Form.:
C16H13N5O2S
Mol. Mass.:
339.372
SMILES:
COc1ccccc1-n1c(n[nH]c1=S)-c1cc([nH]n1)-c1ccco1
: