Target
Regulator of G-protein signaling 4
Ligand
BDBM47829
Substrate
Meas. Tech.
Dose response, multiplexed high-throughput screen for small molecule regulators of RGS family protein interactions, specifically RGS4-Galphao.
EC50
30000±n/a nM
Citation
 PubChem, PC Dose response, multiplexed high-throughput screen for small molecule regulators of RGS family protein interactions, specifically RGS4-Galphao. PubChem Bioassay (2009)[AID] 
Target
Name:
Regulator of G-protein signaling 4
Synonyms:
RGP4 RGS4_HUMAN | Regulator of G-protein signaling 4 (RGS4)
Type:
Enzyme
Mol. Mass.:
23263.51
Organism:
Homo sapiens (Human)
Description:
P49798
Residue:
205
  
Inhibitor
Name:
BDBM47829
Synonyms:
(5Z)-5-[ethoxy(hydroxy)methylene]-2-[3-(trifluoromethyl)phenyl]-2-thiazolin-4-one (5Z)-5-[ethoxy(hydroxy)methylidene]-2-[3-(trifluoromethyl)phenyl]-4-thiazolone MLS000851000 cid_5922688 | ethyl 4-hydroxy-2-[3-(trifluoromethyl)phenyl]-1,3-thiazole-5-carboxylate
Type:
Small organic molecule
Emp. Form.:
C13H10F3NO3S
Mol. Mass.:
317.284
SMILES:
CCOC(=O)c1sc(nc1O)-c1cccc(c1)C(F)(F)F
: