Target
Mitogen-activated protein kinase kinase kinase kinase 2
Ligand
BDBM51822
Substrate
Meas. Tech.
Dose Response Confirmation Screen via Multiplex HTS Assay for Inhibitors of MEK Kinase PB1 Domains, specifically MEK5 binding to MEK Kinase 2 Mutant
EC50
30000±n/a nM
Citation
 PubChem, PC Dose Response Confirmation Screen via Multiplex HTS Assay for Inhibitors of MEK Kinase PB1 Domains, specifically MEK5 binding to MEK Kinase 2 Mutant PubChem Bioassay (2009)[AID] 
Target
Name:
Mitogen-activated protein kinase kinase kinase kinase 2
Synonyms:
2.7.11.1 GC kinase Germinal center kinase MAP4K2 MEK kinase kinase 2 RAB8IP | Rab8-interacting protein
Type:
Mol. Mass.:
91551.35
Organism:
Homo sapiens (Human)
Description:
Residue:
820
  
Inhibitor
Name:
BDBM51822
Synonyms:
MLS000418431 N-[(1,3-dioxo-2-isoindolyl)methyl]-N-(2-methoxyphenyl)-3-methylbenzamide N-[[1,3-bis(oxidanylidene)isoindol-2-yl]methyl]-N-(2-methoxyphenyl)-3-methyl-benzamide cid_2307573
Type:
Small organic molecule
Emp. Form.:
C24H20N2O4
Mol. Mass.:
400.4266
SMILES:
COc1ccccc1N(CN1C(=O)c2ccccc2C1=O)C(=O)c1cccc(C)c1
: