Target
Mitogen-activated protein kinase kinase kinase kinase 2
Ligand
BDBM51833
Substrate
Meas. Tech.
Dose Response Confirmation Screen via Multiplex HTS Assay for Inhibitors of MEK Kinase PB1 Domains, specifically MEK5 binding to MEK Kinase 2 Mutant
EC50
30000±n/a nM
Citation
 PubChem, PC Dose Response Confirmation Screen via Multiplex HTS Assay for Inhibitors of MEK Kinase PB1 Domains, specifically MEK5 binding to MEK Kinase 2 Mutant PubChem Bioassay (2009)[AID] 
Target
Name:
Mitogen-activated protein kinase kinase kinase kinase 2
Synonyms:
2.7.11.1 GC kinase Germinal center kinase MAP4K2 MEK kinase kinase 2 RAB8IP | Rab8-interacting protein
Type:
Mol. Mass.:
91551.35
Organism:
Homo sapiens (Human)
Description:
Residue:
820
  
Inhibitor
Name:
BDBM51833
Synonyms:
2-(5-chloro-2-methoxy-N-(4-methyl-3-nitro-phenyl)sulfonyl-anilino)-N-(2-methoxyethyl)acetamide 2-[(5-chloranyl-2-methoxy-phenyl)-(4-methyl-3-nitro-phenyl)sulfonyl-amino]-N-(2-methoxyethyl)ethanamide SMR000274311 | cid_2866136
Type:
Small organic molecule
Emp. Form.:
C19H22ClN3O7S
Mol. Mass.:
471.912
SMILES:
COCCNC(=O)CN(c1cc(Cl)ccc1OC)S(=O)(=O)c1ccc(C)c(c1)[N+]([O-])=O
: