Target
Mitogen-activated protein kinase kinase kinase kinase 2
Ligand
BDBM47635
Substrate
Meas. Tech.
Dose Response Confirmation Screen via Multiplex HTS Assay for Inhibitors of MEK Kinase PB1 Domains, specifically MEK5 binding to MEK Kinase 2 Mutant
EC50
30000±n/a nM
Citation
 PubChem, PC Dose Response Confirmation Screen via Multiplex HTS Assay for Inhibitors of MEK Kinase PB1 Domains, specifically MEK5 binding to MEK Kinase 2 Mutant PubChem Bioassay (2009)[AID] 
Target
Name:
Mitogen-activated protein kinase kinase kinase kinase 2
Synonyms:
2.7.11.1 GC kinase Germinal center kinase MAP4K2 MEK kinase kinase 2 RAB8IP | Rab8-interacting protein
Type:
Mol. Mass.:
91551.35
Organism:
Homo sapiens (Human)
Description:
Residue:
820
  
Inhibitor
Name:
BDBM47635
Synonyms:
(2Z)-2-[(1,6-dimethyl-2-quinolin-1-iumyl)methylidene]-1-ethylthieno[3,2-e][1,3]benzothiazole;iodide (2Z)-2-[(1,6-dimethylquinolin-1-ium-2-yl)methylidene]-1-ethyl-thieno[3,2-e][1,3]benzothiazole;iodide MLS000693112 cid_16192912
Type:
Small organic molecule
Emp. Form.:
C23H21N2S2
Mol. Mass.:
389.556
SMILES:
CCN1\C(Sc2ccc3sccc3c12)=C\c1ccc2cc(C)ccc2[n+]1C
: