Target
Mitogen-activated protein kinase kinase kinase kinase 2
Ligand
BDBM51883
Substrate
Meas. Tech.
Dose Response Confirmation Screen via Multiplex HTS Assay for Inhibitors of MEK Kinase PB1 Domains, specifically MEK5 binding to MEK Kinase 2 Mutant
EC50
30000±n/a nM
Citation
 PubChem, PC Dose Response Confirmation Screen via Multiplex HTS Assay for Inhibitors of MEK Kinase PB1 Domains, specifically MEK5 binding to MEK Kinase 2 Mutant PubChem Bioassay (2009)[AID] 
Target
Name:
Mitogen-activated protein kinase kinase kinase kinase 2
Synonyms:
2.7.11.1 GC kinase Germinal center kinase MAP4K2 MEK kinase kinase 2 RAB8IP | Rab8-interacting protein
Type:
Mol. Mass.:
91551.35
Organism:
Homo sapiens (Human)
Description:
Residue:
820
  
Inhibitor
Name:
BDBM51883
Synonyms:
2-(diethylamino)ethyl 4-[[(Z)-2-[4-(1,3-benzodioxol-5-yl)-1,3-thiazol-2-yl]-2-cyano-ethenyl]amino]benzoate 4-[(Z)-2-(4-Benzo[1,3]dioxol-5-yl-thiazol-2-yl)-2-cyano-vinylamino]-benzoic acid 2-diethylamino-ethyl ester 4-[[(Z)-2-[4-(1,3-benzodioxol-5-yl)thiazol-2-yl]-2-cyano-vinyl]amino]benzoic acid 2-(diethylamino)ethyl ester SMR000434080 | cid_1838764
Type:
Small organic molecule
Emp. Form.:
C26H26N4O4S
Mol. Mass.:
490.574
SMILES:
CCN(CC)CCOC(=O)c1ccc(cc1)N=CC(C#N)c1nc(cs1)-c1ccc2OCOc2c1
: