Target
Mitogen-activated protein kinase kinase kinase kinase 2
Ligand
BDBM51798
Substrate
Meas. Tech.
Dose Response Confirmation via Multiplex HTS Assay for Inhibitors of MEK Kinase PB1 Domains, specifically MEK5 binding to MEK Kinase 2 Wildtype
EC50
1150±n/a nM
Citation
 PubChem, PC Dose Response Confirmation via Multiplex HTS Assay for Inhibitors of MEK Kinase PB1 Domains, specifically MEK5 binding to MEK Kinase 2 Wildtype PubChem Bioassay (2009)[AID] 
Target
Name:
Mitogen-activated protein kinase kinase kinase kinase 2
Synonyms:
2.7.11.1 GC kinase Germinal center kinase MAP4K2 MEK kinase kinase 2 RAB8IP | Rab8-interacting protein
Type:
Mol. Mass.:
91551.35
Organism:
Homo sapiens (Human)
Description:
Residue:
820
  
Inhibitor
Name:
BDBM51798
Synonyms:
3-(4-fluorophenyl)-7,8-dimethoxy-5-[(4-methoxyphenyl)methyl]pyrazolo[4,3-c]quinoline MLS000530112 cid_2136935
Type:
Small organic molecule
Emp. Form.:
C26H22FN3O3
Mol. Mass.:
443.4696
SMILES:
COc1ccc(Cn2cc3c(nnc3c3cc(OC)c(OC)cc23)-c2ccc(F)cc2)cc1
: