Target
Mitogen-activated protein kinase kinase kinase kinase 2
Ligand
BDBM51816
Substrate
Meas. Tech.
Dose Response Confirmation via Multiplex HTS Assay for Inhibitors of MEK Kinase PB1 Domains, specifically MEK5 binding to MEK Kinase 2 Wildtype
EC50
30000±n/a nM
Citation
 PubChem, PC Dose Response Confirmation via Multiplex HTS Assay for Inhibitors of MEK Kinase PB1 Domains, specifically MEK5 binding to MEK Kinase 2 Wildtype PubChem Bioassay (2009)[AID] 
Target
Name:
Mitogen-activated protein kinase kinase kinase kinase 2
Synonyms:
2.7.11.1 GC kinase Germinal center kinase MAP4K2 MEK kinase kinase 2 RAB8IP | Rab8-interacting protein
Type:
Mol. Mass.:
91551.35
Organism:
Homo sapiens (Human)
Description:
Residue:
820
  
Inhibitor
Name:
BDBM51816
Synonyms:
MLS000696829 N-(4-methyl-2-pyridyl)-4-(2-thienyl)tetrahydropyran-4-carboxamide N-(4-methylpyridin-2-yl)-4-thiophen-2-yloxane-4-carboxamide cid_12005896
Type:
Small organic molecule
Emp. Form.:
C16H18N2O2S
Mol. Mass.:
302.391
SMILES:
Cc1ccnc(NC(=O)C2(CCOCC2)c2cccs2)c1
: