Target
Mitogen-activated protein kinase kinase kinase kinase 2
Ligand
BDBM51828
Substrate
Meas. Tech.
Dose Response Confirmation via Multiplex HTS Assay for Inhibitors of MEK Kinase PB1 Domains, specifically MEK5 binding to MEK Kinase 2 Wildtype
EC50
30000±n/a nM
Citation
 PubChem, PC Dose Response Confirmation via Multiplex HTS Assay for Inhibitors of MEK Kinase PB1 Domains, specifically MEK5 binding to MEK Kinase 2 Wildtype PubChem Bioassay (2009)[AID] 
Target
Name:
Mitogen-activated protein kinase kinase kinase kinase 2
Synonyms:
2.7.11.1 GC kinase Germinal center kinase MAP4K2 MEK kinase kinase 2 RAB8IP | Rab8-interacting protein
Type:
Mol. Mass.:
91551.35
Organism:
Homo sapiens (Human)
Description:
Residue:
820
  
Inhibitor
Name:
BDBM51828
Synonyms:
5-[2-hydroxy-3-(4-methyl-1-piperazinyl)propoxy]-2-methyl-1-(4-methylphenyl)-3-indolecarboxylic acid ethyl ester;hydrochloride MLS000727514 cid_16188857 ethyl 5-[2-hydroxy-3-(4-methylpiperazin-1-yl)propoxy]-2-methyl-1-(4-methylphenyl)-1H-indole-3-carboxylate | ethyl 5-[2-hydroxy-3-(4-methylpiperazin-1-yl)propoxy]-2-methyl-1-(4-methylphenyl)indole-3-carboxylate;hydrochloride
Type:
Small organic molecule
Emp. Form.:
C27H35N3O4
Mol. Mass.:
465.5845
SMILES:
CCOC(=O)c1c(C)n(-c2ccc(C)cc2)c2ccc(OCC(O)CN3CCN(C)CC3)cc12
: